[ERROR] Failed to execute goal on project demosnappack:

C:\opt\snaplogic-dev\demosnappack>mvn clean install
[INFO] Scanning for projects…
[WARNING]
[WARNING] Some problems were encountered while building the effective model for com.snaplogic:demosnappack:jar:1-0001
[WARNING] ‘version’ contains an expression but should be a constant. @ com.snaplogic:demosnappack:1-${sl_build}, C:\opt\snaplogic-dev\demosnappack\pom.xml, line 8, column 14
[WARNING]
[WARNING] It is highly recommended to fix these problems because they threaten the stability of your build.
[WARNING]
[WARNING] For this reason, future Maven versions might no longer support building such malformed projects.
[WARNING]
[INFO]
[INFO] ------------------------------------------------------------------------
[INFO] Building demosnappack 1-0001
[INFO] ------------------------------------------------------------------------
[WARNING] The POM for com.snaplogic:mrjob:jar:4.0 is invalid, transitive dependencies (if any) will not be available, enable debug logging for more details
[WARNING] The POM for org.apache.commons:commons-csv:jar:1.0-SNAPSHOT is missing, no dependency information available
[INFO] ------------------------------------------------------------------------
[INFO] BUILD FAILURE
[INFO] ------------------------------------------------------------------------
[INFO] Total time: 3.809 s
[INFO] Finished at: 2018-10-31T16:09:25+04:00
[INFO] Final Memory: 25M/358M
[INFO] ------------------------------------------------------------------------
[ERROR] Failed to execute goal on project demosnappack: Could not resolve dependencies for project com.snaplogic:demosnappack:jar:1-0001: The following artifacts could not be resolved: jdk.tools:jdk.tools:jar:1.8, org.apache.commons:commons-csv:jar:1.0-SNAPSHOT: Could not find artifact jdk.tools:jdk.tools:jar:1.8 at specified path C:\Program Files\Java\jre1.8.0_191/…/lib/tools.jar -> [Help 1]
[ERROR]